{"text_format":"1","workbook":"xlsx","n_sheets":16,"sheets":["GESTION","Copropriétaires","Tant.Lots.Fds","FdsTravLots","Vérif","AUBERT","CARDON","DUBOIS","FONTAINE","HUBERT","LONGUET","MARTIAL","PONTEL","xxx","CoproLots","Lisez-moi"],"not_rendered":{"charts":0,"images":0,"macros":1,"external_links":0,"defined_names":16,"comments":3,"pivot_tables":0},"unopened":[],"bounds":{"document_bytes":16777216,"sheet_cells":100000,"rows_first":2000,"rows_last":500,"rows_between":2000,"halvings":0,"cell_chars":16384,"cell_head_chars":4096},"cells_cut":0,"cells_raw":0,"read":"whole","date_system":"1900"}

{"sheet":"GESTION","index":0,"n_rows":88,"n_cols":46,"rows_kept":88,"cut":false,"hidden":false,"merged":[]}
["Syndicat des Copropriétaires",null,null,"Exercice du","1er janvier",2017,null,1,null,{"$f":"($G$4=3)+($G$4=4)+($G$4=5)+($G$4=6)+($G$4=12)+($G$4=13)+($G$4=14)+($G$4=20)+($G$4=21)+($G$4=22)+($G$4=28)+($G$4=29)+($G$4=30)+(($G$4=8)+($G$4=16)+($G$4=24)+($G$4=32))*2","v":1},{"$f":"(G4=3)+(G4=4)+(G4=5)+(G4=6)+((G4=12)+(G4=13)+(G4=14)+(G4=20)+(G4=21)+(G4=22)+(G4=28)+(G4=29)+(G4=30))*2+(G4=36)*3","v":2},80,null,{"$f":"F2+1","v":2018},null,null,null,{"$f":"Tant.Lots.Fds!M36","v":1},null,null,{"$f":"FdsTravLots!D36","v":-4700},null,null,null,null,null,null,null,null,null,null,null,null,null,null,null,{"$f":"TODAY()","v":"2020-10-06"},null,null,null,null,null,null,3,"1er Appel ","Charges courantes"]
["27 rue de PARIS",162,null,"Au","31 décembre.",2017,null,null,null,null,null,"%",null,null,null,null,null,null,null,null,null,null,null,null,null,null,null,null,null,null,null,null,null,null,null,null,null,null,null,null,null,null,null,4,"2e Appel ",{"$f":"$AT$1","v":"Charges courantes"}]
["08200 LETROU",null,null,null,null,null,null,"OPERATION",null,null,null,null,null,null,null,null,null,null,null,null,null,null,null,null,null,null,null,null,null,null,null,null,null,null,null,null,null,null,null,null,null,null,null,5,"3e Appel ",{"$f":"$AT$1","v":"Charges courantes"}]
[null,null,"Date Avis….:","20/10/17",null,null,20,{"$f":"VLOOKUP($G$4,$AR$1:$AS$20,2,FALSE)","v":"1er Appel Travaux "},null,null,"\"C:\\chemin\\nom classeur.xlms\"",null,null,null,null,null,null,null,null,null,null,null,null,null,null,null,null,null,null,null,null,null,null,null,null,null,null,null,null,null,null,null,null,6,"4e Appel ",{"$f":"$AT$1","v":"Charges courantes"}]
[null,null,"Exigible le ","01//12/17",null,null,null,{"$f":"VLOOKUP($G$4,$AR$1:$AT$20,3)","v":"Electricité"},null,null,null,null,null,null,null,null,null,null,null,null,null,null,null,null,null,null,null,null,null,null,null,null,null,null,null,null,null,null,null,null,null,null,null,8,"Répartition ",{"$f":"$AT$1","v":"Charges courantes"}]
[{"$f":"G4","v":20},{"$f":"VLOOKUP($G$4,$AR$1:$AS$20,2,FALSE)","v":"1er Appel Travaux "},":",null,null,null,null,null,null,null,null,null,null,null,null,null,null,null,null,null,null,null,null,null,null,null,null,null,null,null,null,null,null,null,null,null,null,null,null,null,null,null,null,12,"1erAppel Travaux ","Peinture"]
[null,{"$f":"VLOOKUP($G$4,$AR$1:$AT$20,3,FALSE)","v":"Electricité"},"G E S T I O N    G E N E R A L E",null,null,null,"Sauvegarde du 29.09.20",null,null,null,null,null,null,null,null,null,null,null,null,null,null,null,null,null,null,null,null,"G E S T I O N    G E N E R A L E",null,null,null,null,null,null,null,null,null,null,null,null,null,null,null,13,"2e Appel Travaux ",{"$f":"$AT$6","v":"Peinture"}]
[null,null,null,null,null,null,null,null,null,null,null,null,null,null,null,null,null,null,null,null,null,null,null,null,null,null,null,null,null,null,null,null,null,null,null,null,null,null,null,null,null,"DEB.tableau",null,14,"3e Appel Travaux ",{"$f":"$AT$6","v":"Peinture"}]
[null,null,3,4,5,6,null,8,null,null,null,12,13,14,null,16,null,null,null,20,21,22,null,24,null,null,null,28,29,30,null,32,null,null,null,36,null,null,null,40,41,null,null,16,"Répart.Travaux",{"$f":"$AT$6","v":"Peinture"}]
["Tableau 1","FIN.tableau",null,null,null,null,null,null,null,null,null,null,"Travaux 1",{"$f":"AT6","v":"Peinture"},null,"Travaux 1",{"$f":"AT6","v":"Peinture"},null,null,null,"Travaux 2",{"$f":"AT10","v":"Electricité"},null,"Travaux 2",{"$f":"V10","v":"Electricité"},null,null,null,"Travaux 3",null,null,"Travaux 3",{"$f":"AD10","v":0},null,null,"Charges Locatives",null,"T.V.A.",null,"Avance Trésorerie","Fds Travaux  ",null,null,20,"1er Appel Travaux ","Electricité"]
{"$rows_left_out":79}
{"sheet":"Copropriétaires","index":1,"n_rows":32,"n_cols":29,"rows_kept":32,"cut":false,"hidden":false,"merged":[]}
[]
["COPROPRIETAIRES"]
[]
["Tableau A"]
["Code","Nom abrégé","Civilité et Nom",null,null,null,"Adresse",null,null,"C.P. Ville"]
[450.00099999999998,"AUBERT","Mr AUBERT J.Paul",null,null,null,"27 rue de Paris",null,null,"08200 LETROU"]
[450.00200000000001,"CARDIN","Mme CARDON Marie",null,null,null,"27 rue de Paris",null,null,"08200 LETROU"]
[450.00299999999999,"DUBOIS","Mr DUBOIS",null,null,null,"5 rue de Rennes",null,null,"77150 Lésigny"]
[450.005,"FONTAINE","Mme FONTAINE",null,null,null,"10 rue de la Paix",null,null,"85340 Olonne sur Mer"]
[450.00599999999997,"HUBERT","Mr HUBERT",null,null,null,"27 rue de Paris",null,null,"08200 LETROU"]
{"$rows_left_out":23}
{"sheet":"Tant.Lots.Fds","index":2,"n_rows":38,"n_cols":34,"rows_kept":38,"cut":false,"hidden":false,"merged":[]}
[99,2,3,4,5,6,7,8,9,10,11,12,13,14,15,"Util.Av.Trav.",null,null,null,null,null,"Util.Av.Trav.",null,null,"Utilisation",null,null,null,null,"CONSOMMATIONS EAU"]
["Date de mise à jour 14",null,null,null,null,null,null,null,null,null,null,null,"Prov.eau","Eau Indiv.",null,null,{"$f":"VLOOKUP(1,GESTION!$A$12:$AQ$27,GESTION!$G$4,0)*(GESTION!$K$1=2)","v":6000},{"$f":"VLOOKUP(2,GESTION!$A$12:$AQ$27,GESTION!$G$4,0)*(GESTION!$K$1=2)","v":0},{"$f":"VLOOKUP(3,GESTION!$A$12:$AQ$27,GESTION!$G$4,0)*(GESTION!$K$1=2)","v":0},{"$f":"VLOOKUP(4,GESTION!$A$12:$AQ$27,GESTION!$G$4,0)*(GESTION!$K$1=2)","v":0},{"$f":"VLOOKUP(5,GESTION!$A$12:$AQ$27,GESTION!$G$4,0)*(GESTION!$K$1=2)","v":0},{"$f":"GESTION!$L$24*(GESTION!$G$4=12)+GESTION!$T$24*(GESTION!$G$4=20)+GESTION!$AB$24*(GESTION!$G$4=28)","v":0},{"$f":"SUM(Q2:U2)","v":6000},null,{"$f":"GESTION!L1/100","v":0.8}]
[null,null,null,null,null,null,null,"Cle 1","Clé 2","Clé 3","Clé 4","Clé 5",null,null,"Clé 8"]
["N°Lot","Désignation","Bât./Escal;","Etage","N°Cop","Copopriétaires","Locataires","Ch.Géné","Ch.Bât,","Escal.A","Escal.B","WC Com",null,2017,null,{"$f":"IF(GESTION!$J$1=1,GESTION!$D$5,\"\")","v":"01//12/17"},"Ch.Géné","Ch.Bât,","Escal.A","Escal.B","WC Com",{"$f":"IF(GESTION!$J$1=1,GESTION!$D$5,\"\")","v":"01//12/17"},"A FINANCER","FONDS","Utilisation","Reste",null,"LOTS",null,null,1,2015,2016,2017]
[2,"Pavillon",null,"RDC",450.00799999999998,{"$f":"IF(E5<>\"\",VLOOKUP(E5,Copropriétaires!$A$6:$L$25,2),\"\")","v":"MARTIAL"},null,300,null,null,null,null,null,17,null,{"$f":"ROUND($P$3*H5/$H$36,2)","v":0},{"$f":"IF(H5>0,ROUND($Q$2*H5/10000,2),0)","v":180},{"$f":"IF(I5>0,ROUND($R$2*I5/1000,2),0)","v":0},{"$f":"IF(J5>0,ROUND($S$2*J5/1000,2),0)","v":0},{"$f":"IF(K5>0,ROUND($T$2*K5/1000,2),0)","v":0},{"$f":"IF(L5>0,ROUND($U$2*L5/1000,2),0)","v":0},{"$f":"IF($H5>0,ROUND($V$2*$H5/10000,2),0)","v":0},{"$f":"SUM(Q5:V5)*(SUM(Q5:V5)>0)","v":180},{"$f":"VLOOKUP(A5,FdsTravLots!$A$4:$C$35,3,0)","v":141},{"$f":"IF(ROUND(W5*$Y$2,2),-X5,ROUND(W5*$Y$2,2))","v":-141},{"$f":"X5+Y5","v":0},null,{"$f":"A5","v":2},{"$f":"F5","v":"MARTIAL"},null,null,31,16,17]
[11,"Cave N° 1","1,A","SS",450.00599999999997,{"$f":"IF(E6<>\"\",VLOOKUP(E6,Copropriétaires!$A$6:$L$25,2),\"\")","v":"HUBERT"},null,70,8,127,null,null,null,null,null,{"$f":"ROUND($P$3*H6/$H$36,2)","v":0},42,0,0,0,0,{"$f":"IF($H6>0,ROUND($V$2*$H6/10000,2),0)","v":0},{"$f":"SUM(Q6:V6)*(SUM(Q6:V6)>0)","v":42},{"$f":"VLOOKUP(A6,FdsTravLots!$A$4:$C$35,3,0)","v":32.9},{"$f":"IF(ROUND(W6*$Y$2,2),-X6,ROUND(W6*$Y$2,2))","v":-32.9},0,null,11,{"$f":"F6","v":"HUBERT"}]
[12,"Cave N° 2","1,A","SS",450.005,{"$f":"IF(E7<>\"\",VLOOKUP(E7,Copropriétaires!$A$6:$L$25,2),\"\")","v":"FONTAINE"},null,40,5,79,null,null,null,null,null,0,24,0,0,0,0,0,24,{"$f":"VLOOKUP(A7,FdsTravLots!$A$4:$C$35,3,0)","v":18.8},-18.8,0,null,12,"FONTAINE"]
[13,"Cave N° 3","1,A","SS",450.00299999999999,{"$f":"IF(E8<>\"\",VLOOKUP(E8,Copropriétaires!$A$6:$L$25,2),\"\")","v":"DUBOIS"},null,230,27,429,null,null,null,null,null,0,138,0,0,0,0,0,138,{"$f":"VLOOKUP(A8,FdsTravLots!$A$4:$C$35,3,0)","v":108.1},-108.1,0,null,13,"DUBOIS"]
[14,"Cave N° 4","1,A","SS",450.00900000000001,{"$f":"IF(E9<>\"\",VLOOKUP(E9,Copropriétaires!$A$6:$L$25,2),\"\")","v":"PONTEL"},null,30,4,64,null,null,null,null,null,0,18,0,0,0,0,0,18,{"$f":"VLOOKUP(A9,FdsTravLots!$A$4:$C$35,3,0)","v":14.1},-14.1,0,null,14,"PONTEL"]
[15,"Cave N° 5","1,A","SS",450.00700000000001,{"$f":"IF(E10<>\"\",VLOOKUP(E10,Copropriétaires!$A$6:$L$25,2),\"\")","v":"LONGUET"},null,80,9,143,null,null,null,null,null,0,48,0,0,0,0,0,48,{"$f":"VLOOKUP(A10,FdsTravLots!$A$4:$C$35,3,0)","v":37.6},-37.6,0,null,15,"LONGUET"]
{"$rows_left_out":29}
{"sheet":"FdsTravLots","index":3,"n_rows":36,"n_cols":26,"rows_kept":36,"cut":false,"hidden":false,"merged":[]}
[]
[null,7,null,"Utilisation",5,6,7,8,9,10,11,12,13,14,15,16,17,18,19,20,21,22,23,24,25,26]
["N°Lot","Désignation","FONDS TRAV","Utilisation",null,"2007-01-10"]
[{"$f":"Tant.Lots.Fds!A5","v":2},{"$f":"Tant.Lots.Fds!B5","v":"Pavillon"},{"$f":"SUM(E4:Z4)","v":141},-141,96,15,null,15,15]
[{"$f":"Tant.Lots.Fds!A6","v":11},{"$f":"Tant.Lots.Fds!B6","v":"Cave N° 1"},32.9,-32.9,22.4,3.5,null,3.5,3.5]
[{"$f":"Tant.Lots.Fds!A7","v":12},{"$f":"Tant.Lots.Fds!B7","v":"Cave N° 2"},18.8,-18.8,12.8,2,null,2,2]
[{"$f":"Tant.Lots.Fds!A8","v":13},{"$f":"Tant.Lots.Fds!B8","v":"Cave N° 3"},108.1,-108.1,73.599999999999994,11.5,null,11.5,11.5]
[{"$f":"Tant.Lots.Fds!A9","v":14},{"$f":"Tant.Lots.Fds!B9","v":"Cave N° 4"},14.1,-14.1,9.6,1.5,null,1.5,1.5]
[{"$f":"Tant.Lots.Fds!A10","v":15},{"$f":"Tant.Lots.Fds!B10","v":"Cave N° 5"},37.6,-37.6,25.6,4,null,4,4]
[{"$f":"Tant.Lots.Fds!A11","v":16},{"$f":"Tant.Lots.Fds!B11","v":"Cave N° 6"},18.8,-18.8,12.8,2,null,2,2]
{"$rows_left_out":27}
{"sheet":"Vérif","index":4,"n_rows":71,"n_cols":21,"rows_kept":71,"cut":false,"hidden":false,"merged":[]}
[{"$f":"GESTION!A1","v":"Syndicat des Copropriétaires"},null,null,"Exercice du",{"$f":"GESTION!E1","v":"1er janvier"},{"$f":"GESTION!F1","v":2017}]
[{"$f":"GESTION!A2","v":"27 rue de PARIS"},null,null,"Au",{"$f":"GESTION!E2","v":"31 décembre."},{"$f":"GESTION!F2","v":2017}]
[{"$f":"GESTION!A3","v":"08200 LETROU"}]
[]
[]
[null,null,null,null,null,null,null,null,"Opération :",null,null,null,null,null,null,null,null,null,null,"Opération"]
[null,null,null,null,null,null,null,null,{"$f":"GESTION!$G$4","v":20},{"$f":"GESTION!$H$4","v":"1er Appel Travaux "},null,null,null,null,null,null,null,null,null,{"$f":"GESTION!$G$4","v":20},{"$f":"GESTION!$H$4","v":"1er Appel Travaux "}]
[]
[null,"CLE","Designation",null,"Tantièmes",null,"Réparti",null,"Code","Copropriétaires","Appels Ch.Ctes",{"$f":"IF(GESTION!$K$1=1,\"Appel Fonds Travaux\",\"Remb,Avance Travaux\")","v":"Remb,Avance Travaux"},"Av.Trésorerie","Provisions","Finan,Travaux","SOLDES","Relevés Déb.","Relevés Cred,","Soldes",null,"T.V.A."]
[null,1,"Charges Générales",null,{"$f":"SUM(AUBERT:PONTEL!$E$90)","v":10000},null,{"$f":"SUM(AUBERT:PONTEL!$G$90)","v":6000},null,{"$f":"Copropriétaires!A6","v":450.00099999999998},{"$f":"Copropriétaires!B6","v":"AUBERT"},{"$f":"AUBERT!$G$98","v":702},{"$f":"AUBERT!$G$99","v":0},{"$f":"AUBERT!$G$100","v":0},{"$f":"AUBERT!$G$38","v":0},{"$f":"AUBERT!$G$103","v":-549.90000000000009},{"$f":"K10+L10+M10+N10+O10","v":152.09999999999991},{"$f":"AUBERT!$F$49","v":0},{"$f":"AUBERT!$G$49","v":0},{"$f":"P10+Q10-R10","v":152.09999999999991},null,{"$f":"AUBERT!$L$37","v":0}]
{"$rows_left_out":62}
{"sheet":"AUBERT","index":5,"n_rows":103,"n_cols":14,"rows_kept":103,"cut":false,"hidden":false,"merged":[]}
[{"$f":"GESTION!A1","v":"Syndicat des Copropriétaires"}]
[{"$f":"GESTION!A2","v":"27 rue de PARIS"},null,null,null,null,null,{"$f":"Copropriétaires!$A$6","v":450.00099999999998},{"$f":"VLOOKUP($G$2,Copropriétaires!$A$6:'Copropriétaires'!$L$25,3,FALSE)","v":"Mr AUBERT J.Paul"}]
[{"$f":"GESTION!A3","v":"08200 LETROU"},null,null,null,null,null,null,{"$f":"VLOOKUP($G$2,Copropriétaires!$A$6:'Copropriétaires'!$L$25,7,FALSE)","v":"27 rue de Paris"}]
[null,null,null,null,null,null,null,{"$f":"VLOOKUP($G$2,Copropriétaires!$A$6:'Copropriétaires'!$L$25,10,FALSE)","v":"08200 LETROU"}]
[null,null,null,"Date d'avis:",{"$f":"GESTION!$D$4","v":"20/10/17"}]
[null,null,null,"Exigible",{"$f":"GESTION!$D$5","v":"01//12/17"}]
[]
["Lots 16,  25, 26",null,{"$f":"GESTION!$G$4","v":20},{"$f":"CONCATENATE(GESTION!$H$4,\" \",GESTION!$H$5)","v":"1er Appel Travaux  Electricité"}]
[null,"1170/10000",null,{"$f":"CONCATENATE(\"Exercice du \",GESTION!$E$1,\" \",GESTION!$F$1,\" au \",GESTION!$E$2,\" \",GESTION!$F$2)","v":"Exercice du 1er janvier 2017 au 31 décembre. 2017"},null,null,null,{"$f":"OR(GESTION!$G$4=8,GESTION!$G$4=16,GESTION!$G$4=24,GESTION!$G$4=32,GESTION!$G$4=36)","v":false}]
[null,null,null,null,null,null,null,null,{"$f":"GESTION!$L$1","v":80},"%"]
{"$rows_left_out":94}
{"sheet":"CARDON","index":6,"n_rows":103,"n_cols":15,"rows_kept":103,"cut":false,"hidden":false,"merged":[]}
[{"$f":"GESTION!A1","v":"Syndicat des Copropriétaires"}]
[{"$f":"GESTION!A2","v":"27 rue de PARIS"},null,null,null,null,null,{"$f":"Copropriétaires!$A$7","v":450.00200000000001},{"$f":"VLOOKUP($G$2,Copropriétaires!$A$6:'Copropriétaires'!$L$25,3,FALSE)","v":"Mme CARDON Marie"}]
[{"$f":"GESTION!A3","v":"08200 LETROU"},null,null,null,null,null,null,{"$f":"VLOOKUP($G$2,Copropriétaires!$A$6:'Copropriétaires'!$L$25,7,FALSE)","v":"27 rue de Paris"}]
[null,null,null,null,null,null,null,{"$f":"VLOOKUP($G$2,Copropriétaires!$A$6:'Copropriétaires'!$L$25,10,FALSE)","v":"08200 LETROU"}]
[null,null,null,"Date d'avis:",{"$f":"GESTION!$D$4","v":"20/10/17"}]
[null,null,null,"Exigible",{"$f":"GESTION!$D$5","v":"01//12/17"}]
[]
["Lots ,41, 42, 43, 103",null,{"$f":"GESTION!$G$4","v":20},{"$f":"CONCATENATE(GESTION!$H$4,\" \",GESTION!$H$5)","v":"1er Appel Travaux  Electricité"}]
[null,"1189/10000",null,{"$f":"CONCATENATE(\"Exercice du \",GESTION!$E$1,\" \",GESTION!$F$1,\" au \",GESTION!$E$2,\" \",GESTION!$F$2)","v":"Exercice du 1er janvier 2017 au 31 décembre. 2017"},null,null,{"$f":"OR(GESTION!G4=8,GESTION!G4=16,GESTION!G4=24,GESTION!G4=32,GESTION!G4=36)","v":false}]
[null,null,null,null,null,null,null,null,{"$f":"GESTION!$L$1","v":80},"%"]
{"$rows_left_out":94}
{"sheet":"DUBOIS","index":7,"n_rows":103,"n_cols":14,"rows_kept":103,"cut":false,"hidden":false,"merged":[]}
[{"$f":"GESTION!A1","v":"Syndicat des Copropriétaires"}]
[{"$f":"GESTION!A2","v":"27 rue de PARIS"},null,null,null,null,null,{"$f":"Copropriétaires!$A$8","v":450.00299999999999},{"$f":"VLOOKUP($G$2,Copropriétaires!$A$6:'Copropriétaires'!$L$25,3,FALSE)","v":"Mr DUBOIS"}]
[{"$f":"GESTION!A3","v":"08200 LETROU"},null,null,null,null,null,null,{"$f":"VLOOKUP($G$2,Copropriétaires!$A$6:'Copropriétaires'!$L$25,7,FALSE)","v":"5 rue de Rennes"}]
[null,null,null,null,null,null,null,{"$f":"VLOOKUP($G$2,Copropriétaires!$A$6:'Copropriétaires'!$L$25,10,FALSE)","v":"77150 Lésigny"}]
[null,null,null,"Date d'avis:",{"$f":"GESTION!$D$4","v":"20/10/17"}]
[null,null,null,"Exigible",{"$f":"GESTION!$D$5","v":"01//12/17"}]
[]
["Lots 13, 18, 19, 23,",null,{"$f":"GESTION!$G$4","v":20},{"$f":"CONCATENATE(GESTION!$H$4,\" \",GESTION!$H$5)","v":"1er Appel Travaux  Electricité"}]
[null,"1950/10,000",null,{"$f":"CONCATENATE(\"Exercice du \",GESTION!$E$1,\" \",GESTION!$F$1,\" au \",GESTION!$E$2,\" \",GESTION!$F$2)","v":"Exercice du 1er janvier 2017 au 31 décembre. 2017"},null,null,null,{"$f":"OR(GESTION!G4=8,GESTION!G4=16,GESTION!G4=24,GESTION!G4=32,GESTION!G4=36)","v":false}]
[null,null,null,null,null,null,null,null,{"$f":"GESTION!$L$1","v":80},"%"]
{"$rows_left_out":94}
{"sheet":"FONTAINE","index":8,"n_rows":103,"n_cols":17,"rows_kept":103,"cut":false,"hidden":false,"merged":[]}
[{"$f":"GESTION!A1","v":"Syndicat des Copropriétaires"}]
[{"$f":"GESTION!A2","v":"27 rue de PARIS"},null,null,null,null,null,450.005,{"$f":"VLOOKUP($G$2,Copropriétaires!$A$6:'Copropriétaires'!$L$25,3,FALSE)","v":"Mme FONTAINE"}]
[{"$f":"GESTION!A3","v":"08200 LETROU"},null,null,null,null,null,null,{"$f":"VLOOKUP($G$2,Copropriétaires!$A$6:'Copropriétaires'!$L$25,7,FALSE)","v":"10 rue de la Paix"}]
[null,null,null,null,null,null,null,{"$f":"VLOOKUP($G$2,Copropriétaires!$A$6:'Copropriétaires'!$L$25,10,FALSE)","v":"85340 Olonne sur Mer"}]
[null,null,null,"Date d'avis:",{"$f":"GESTION!$D$4","v":"20/10/17"}]
[null,null,null,"Exigible",{"$f":"GESTION!$D$5","v":"01//12/17"}]
[]
["Lots 12, 14, 17 ,21, 22",null,{"$f":"GESTION!$G$4","v":20},{"$f":"CONCATENATE(GESTION!$H$4,\" \",GESTION!$H$5)","v":"1er Appel Travaux  Electricité"}]
["24, 27","2060/10000",null,{"$f":"CONCATENATE(\"Exercice du \",GESTION!$E$1,\" \",GESTION!$F$1,\" au \",GESTION!$E$2,\" \",GESTION!$F$2)","v":"Exercice du 1er janvier 2017 au 31 décembre. 2017"},null,null,{"$f":"OR(GESTION!G4=8,GESTION!G4=16,GESTION!G4=24,GESTION!G4=32,GESTION!G4=36)","v":false}]
[null,null,null,null,null,null,null,null,{"$f":"GESTION!$L$1","v":80},"%"]
{"$rows_left_out":94}
{"sheet":"HUBERT","index":9,"n_rows":103,"n_cols":14,"rows_kept":103,"cut":false,"hidden":false,"merged":[]}
[{"$f":"GESTION!A1","v":"Syndicat des Copropriétaires"}]
[{"$f":"GESTION!A2","v":"27 rue de PARIS"},null,null,null,null,null,{"$f":"Copropriétaires!$A$10","v":450.00599999999997},{"$f":"VLOOKUP($G$2,Copropriétaires!$A$6:'Copropriétaires'!$L$25,3,FALSE)","v":"Mr HUBERT"}]
[{"$f":"GESTION!A3","v":"08200 LETROU"},null,null,null,null,null,null,{"$f":"VLOOKUP($G$2,Copropriétaires!$A$6:'Copropriétaires'!$L$25,7,FALSE)","v":"27 rue de Paris"}]
[null,null,null,null,null,null,null,{"$f":"VLOOKUP($G$2,Copropriétaires!$A$6:'Copropriétaires'!$L$25,10,FALSE)","v":"08200 LETROU"}]
[null,null,null,"Date d'avis:",{"$f":"GESTION!$D$4","v":"20/10/17"}]
[null,null,null,"Exigible",{"$f":"GESTION!$D$5","v":"01//12/17"}]
[]
["Lots 11, 28,",null,null,{"$f":"GESTION!$G$4","v":20},{"$f":"CONCATENATE(GESTION!$H$4,\" \",GESTION!$H$5)","v":"1er Appel Travaux  Electricité"}]
[null,null,"2230/10000",null,{"$f":"CONCATENATE(\"Exercice du \",GESTION!$E$1,\" \",GESTION!$F$1,\" au \",GESTION!$E$2,\" \",GESTION!$F$2)","v":"Exercice du 1er janvier 2017 au 31 décembre. 2017"},null,null,{"$f":"OR(GESTION!G4=8,GESTION!G4=16,GESTION!G4=24,GESTION!G4=32,GESTION!G4=36)","v":false}]
[null,null,null,null,null,null,null,null,{"$f":"GESTION!$L$1","v":80},"%"]
{"$rows_left_out":94}
{"sheet":"LONGUET","index":10,"n_rows":103,"n_cols":14,"rows_kept":103,"cut":false,"hidden":false,"merged":[]}
[{"$f":"GESTION!A1","v":"Syndicat des Copropriétaires"}]
[{"$f":"GESTION!A2","v":"27 rue de PARIS"},null,null,null,null,null,{"$f":"Copropriétaires!$A$11","v":450.00700000000001},{"$f":"VLOOKUP($G$2,Copropriétaires!$A$6:'Copropriétaires'!$L$25,3,FALSE)","v":"Mr LONGUET Jean Pierre"}]
[{"$f":"GESTION!A3","v":"08200 LETROU"},null,null,null,null,null,null,{"$f":"VLOOKUP($G$2,Copropriétaires!$A$6:'Copropriétaires'!$L$25,7,FALSE)","v":"9 allée Verte"}]
[null,null,null,null,null,null,null,{"$f":"VLOOKUP($G$2,Copropriétaires!$A$6:'Copropriétaires'!$L$25,10,FALSE)","v":"83270 Saint Cyr sur Mer"}]
[null,null,null,"Date d'avis:",{"$f":"GESTION!$D$4","v":"20/10/17"}]
[null,null,null,"Exigible",{"$f":"GESTION!$D$5","v":"01//12/17"}]
[]
["Lots 15,29, 30,",null,{"$f":"GESTION!$G$4","v":20},{"$f":"CONCATENATE(GESTION!$H$4,\" \",GESTION!$H$5)","v":"1er Appel Travaux  Electricité"}]
[null,"990/10,000",null,{"$f":"CONCATENATE(\"Exercice du \",GESTION!$E$1,\" \",GESTION!$F$1,\" au \",GESTION!$E$2,\" \",GESTION!$F$2)","v":"Exercice du 1er janvier 2017 au 31 décembre. 2017"},null,null,null,{"$f":"OR(GESTION!G4=8,GESTION!G4=16,GESTION!G4=24,GESTION!G4=32,GESTION!G4=36)","v":false}]
[null,null,null,null,null,null,null,null,{"$f":"GESTION!$L$1","v":80},"%"]
{"$rows_left_out":94}
{"sheet":"MARTIAL","index":11,"n_rows":103,"n_cols":14,"rows_kept":103,"cut":false,"hidden":false,"merged":[]}
[{"$f":"GESTION!A1","v":"Syndicat des Copropriétaires"}]
[{"$f":"GESTION!A2","v":"27 rue de PARIS"},null,null,null,null,null,{"$f":"Copropriétaires!$A$12","v":450.00799999999998},{"$f":"VLOOKUP($G$2,Copropriétaires!$A$6:'Copropriétaires'!$L$25,3,FALSE)","v":"Mr MARTIAL Paul"}]
[{"$f":"GESTION!A3","v":"08200 LETROU"},null,null,null,null,null,null,{"$f":"VLOOKUP($G$2,Copropriétaires!$A$6:'Copropriétaires'!$L$25,7,FALSE)","v":"27 rue de Paris"}]
[null,null,null,null,null,null,null,{"$f":"VLOOKUP($G$2,Copropriétaires!$A$6:'Copropriétaires'!$L$25,10,FALSE)","v":"08200 LETROU"}]
[null,null,null,"Date d'avis:",{"$f":"GESTION!$D$4","v":"20/10/17"}]
[null,null,null,"Exigible",{"$f":"GESTION!$D$5","v":"01//12/17"}]
[]
["Lot  2, 104,105,106",null,{"$f":"GESTION!$G$4","v":20},{"$f":"CONCATENATE(GESTION!$H$4,\" \",GESTION!$H$5)","v":"1er Appel Travaux  Electricité"}]
[null,"311/10,000",null,{"$f":"CONCATENATE(\"Exercice du \",GESTION!$E$1,\" \",GESTION!$F$1,\" au \",GESTION!$E$2,\" \",GESTION!$F$2)","v":"Exercice du 1er janvier 2017 au 31 décembre. 2017"},null,null,{"$f":"OR(GESTION!G4=8,GESTION!G4=16,GESTION!G4=24,GESTION!G4=32,GESTION!G4=36)","v":false}]
[null,null,null,null,null,null,null,null,{"$f":"GESTION!$L$1","v":80},"%"]
{"$rows_left_out":94}
{"sheet":"PONTEL","index":12,"n_rows":103,"n_cols":14,"rows_kept":103,"cut":false,"hidden":false,"merged":[]}
[{"$f":"GESTION!A1","v":"Syndicat des Copropriétaires"}]
[{"$f":"GESTION!A2","v":"27 rue de PARIS"},null,null,null,null,null,{"$f":"Copropriétaires!$A$13","v":450.00900000000001},{"$f":"VLOOKUP($G$2,Copropriétaires!$A$6:'Copropriétaires'!$L$25,3,FALSE)","v":"Mr PONTEL Louis"}]
[{"$f":"GESTION!A3","v":"08200 LETROU"},null,null,null,null,null,null,{"$f":"VLOOKUP($G$2,Copropriétaires!$A$6:'Copropriétaires'!$L$25,7,FALSE)","v":"27 rue de Paris"}]
[null,null,null,null,null,null,null,{"$f":"VLOOKUP($G$2,Copropriétaires!$A$6:'Copropriétaires'!$L$25,10,FALSE)","v":"08200 LETROU"}]
[null,null,null,"Date d'avis:",{"$f":"GESTION!$D$4","v":"20/10/17"}]
[null,null,null,"Exigible",{"$f":"GESTION!$D$5","v":"01//12/17"}]
[]
["Lot 14, 22,",null,{"$f":"GESTION!$G$4","v":20},{"$f":"CONCATENATE(GESTION!$H$4,\" \",GESTION!$H$5)","v":"1er Appel Travaux  Electricité"}]
[null,"380/10000",null,{"$f":"CONCATENATE(\"Exercice du \",GESTION!$E$1,\" \",GESTION!$F$1,\" au \",GESTION!$E$2,\" \",GESTION!$F$2)","v":"Exercice du 1er janvier 2017 au 31 décembre. 2017"},null,null,{"$f":"OR(GESTION!G4=8,GESTION!G4=16,GESTION!G4=24,GESTION!G4=32,GESTION!G4=36)","v":false}]
[null,null,null,null,null,null,null,null,{"$f":"GESTION!$L$1","v":80},"%"]
{"$rows_left_out":94}
{"sheet":"xxx","index":13,"n_rows":103,"n_cols":14,"rows_kept":103,"cut":false,"hidden":false,"merged":[]}
[{"$f":"GESTION!A1","v":"Syndicat des Copropriétaires"}]
[{"$f":"GESTION!A2","v":"27 rue de PARIS"},null,null,null,null,null,450.01100000000002,{"$f":"VLOOKUP($G$2,Copropriétaires!$A$6:'Copropriétaires'!$L$25,3,FALSE)","v":"xxx"}]
[{"$f":"GESTION!A3","v":"08200 LETROU"},null,null,null,null,null,null,{"$f":"VLOOKUP($G$2,Copropriétaires!$A$6:'Copropriétaires'!$L$25,7,FALSE)","v":0}]
[null,null,null,null,null,null,null,{"$f":"VLOOKUP($G$2,Copropriétaires!$A$6:'Copropriétaires'!$L$25,10,FALSE)","v":0}]
[null,null,null,"Date d'avis:",{"$f":"GESTION!$D$4","v":"20/10/17"}]
[null,null,null,"Exigible",{"$f":"GESTION!$D$5","v":"01//12/17"}]
[]
["Lot …",null,{"$f":"GESTION!$G$4","v":20},{"$f":"CONCATENATE(GESTION!$H$4,\" \",GESTION!$H$5)","v":"1er Appel Travaux  Electricité"}]
[null,null,null,{"$f":"CONCATENATE(\"Exercice du \",GESTION!$E$1,\" \",GESTION!$F$1,\" au \",GESTION!$E$2,\" \",GESTION!$F$2)","v":"Exercice du 1er janvier 2017 au 31 décembre. 2017"},null,null,{"$f":"OR(GESTION!G4=8,GESTION!G4=16,GESTION!G4=24,GESTION!G4=32,GESTION!G4=36)","v":false}]
[null,null,null,null,null,null,null,null,{"$f":"GESTION!$L$1","v":80},"%"]
{"$rows_left_out":94}
{"sheet":"CoproLots","index":14,"n_rows":44,"n_cols":14,"rows_kept":44,"cut":false,"hidden":false,"merged":[]}
[null,null,null,null,"LOTS PAR COPROPRIETAIRES",null,null,null,null,null,null,null,null,{"$f":"TODAY()","v":"2020-10-06"}]
["Date de mise à jour 27.09.20",null,null,null,null,null,null,null,null,null,null,null,"Prov.eau","Eau Indiv."]
[]
["N°Lot","Désignation","Bât./Escal;","Etage","N°Cop","Copopriétaires","Locataires","Ch.Géné","Ch.Bât,","Escal.A","Escal.B","WC Com",2016]
[16,"Cave N° 6","1,A","SS",450.00099999999998,"AUBERT",null,40,5,79]
[25,"Appartement","1,B","2e",450.00099999999998,"AUBERT",null,780,92,null,134,null,114]
[26,"Pièce","1,B","2e",450.00099999999998,"AUBERT",null,350,41,null,60]
[null,null,null,null,"Total 450.001",null,null,{"$f":"SUBTOTAL(9,H5:H7)","v":1170},138,79,194,0,114]
[41,"Maison","A","RDC",450.00200000000001,"CARDIN",null,940,null,null,null,null,117]
[42,"Remises -Auvent","B","RDC",450.00200000000001,"CARDIN",null,100]
{"$rows_left_out":35}
{"sheet":"Lisez-moi","index":15,"n_rows":79,"n_cols":1,"rows_kept":79,"cut":false,"hidden":false,"merged":[]}
[]
[]
[]
["                                                          D O C U M E N T A T I O N "]
[]
[]
["         Cette application sous EXCEL est destinée à la gestion des charges de copropriétés; Appels de charges et répartitionn de charges courantes et"]
["travaux, ainsi que la gestion de la constitution et de l' utilisation du \"Fonds travaux\"."]
[]
[]
{"$rows_left_out":69}